Details

      Description

      Build:https://jenkins.mesosphere.com/service/jenkins/view/Marathon/job/marathon-pipelines/job/master/175/

      gine.scala:410)
        at org.scalatest.SuperEngine$$anonfun$traverseSubNodes$1$1.apply(Engine.scala:384)
        at scala.collection.immutable.List.foreach(List.scala:381)
        at org.scalatest.SuperEngine.traverseSubNodes$1(Engine.scala:384)
        at org.scalatest.SuperEngine.org$scalatest$SuperEngine$$runTestsInBranch(Engine.scala:379)
        at org.scalatest.SuperEngine.runTestsImpl(Engine.scala:461)
        at org.scalatest.WordSpecLike$class.runTests(WordSpecLike.scala:1147)
        at org.scalatest.WordSpec.runTests(WordSpec.scala:1881)
        at org.scalatest.Suite$class.run(Suite.scala:1147)
        at org.scalatest.WordSpec.org$scalatest$WordSpecLike$$super$run(WordSpec.scala:1881)
        at org.scalatest.WordSpecLike$$anonfun$run$1.apply(WordSpecLike.scala:1192)
        at org.scalatest.WordSpecLike$$anonfun$run$1.apply(WordSpecLike.scala:1192)
        at org.scalatest.SuperEngine.runImpl(Engine.scala:521)
        at org.scalatest.WordSpecLike$class.run(WordSpecLike.scala:1192)
        at mesosphere.IntegrationTest.org$scalatest$BeforeAndAfter$$super$run(UnitTest.scala:94)
        at org.scalatest.BeforeAndAfter$class.run(BeforeAndAfter.scala:258)
        at mesosphere.IntegrationTest.org$scalatest$BeforeAndAfterAll$$super$run(UnitTest.scala:94)
        at org.scalatest.BeforeAndAfterAll$class.liftedTree1$1(BeforeAndAfterAll.scala:213)
        at org.scalatest.BeforeAndAfterAll$class.run(BeforeAndAfterAll.scala:210)
        at mesosphere.IntegrationTest.run(UnitTest.scala:94)
        at org.scalatest.tools.Framework.org$scalatest$tools$Framework$$runSuite(Framework.scala:314)
        at org.scalatest.tools.Framework$ScalaTestTask.execute(Framework.scala:480)
        at sbt.ForkMain$Run$2.call(ForkMain.java:296)
        at sbt.ForkMain$Run$2.call(ForkMain.java:286)
        at java.util.concurrent.FutureTask.run(FutureTask.java:266)
        at java.util.concurrent.ThreadPoolExecutor.runWorker(ThreadPoolExecutor.java:1142)
        at java.util.concurrent.ThreadPoolExecutor$Worker.run(ThreadPoolExecutor.java:617)
        at java.lang.Thread.run(Thread.java:745)
        Cause: java.lang.RuntimeException: No matching events
        at mesosphere.marathon.integration.setup.MarathonTest$$anonfun$waitForEventMatching$1$$anonfun$apply$19.apply(MarathonTest.scala:488)
        at mesosphere.marathon.integration.setup.MarathonTest$$anonfun$waitForEventMatching$1$$anonfun$apply$19.apply(MarathonTest.scala:488)
        at scala.Option.getOrElse(Option.scala:121)
        at mesosphere.marathon.integration.setup.MarathonTest$$anonfun$waitForEventMatching$1.apply(MarathonTest.scala:488)
        at mesosphere.marathon.integration.setup.MarathonTest$$anonfun$waitForEventMatching$1.apply(MarathonTest.scala:486)
        at org.scalatest.concurrent.Eventually$class.makeAValiantAttempt$1(Eventually.scala:395)
        at org.scalatest.concurrent.Eventually$class.tryTryAgain$1(Eventually.scala:409)
        at org.scalatest.concurrent.Eventually$class.eventually(Eventually.scala:439)
        at mesosphere.marathon.integration.GroupDeployIntegrationTest.eventually(GroupDeployIntegrationTest.scala:14)
        at org.scalatest.concurrent.Eventually$class.eventually(Eventually.scala:337)
        at mesosphere.marathon.integration.GroupDeployIntegrationTest.eventually(GroupDeployIntegrationTest.scala:14)
        at mesosphere.marathon.integration.setup.MarathonTest$class.waitForEventMatching(MarathonTest.scala:486)
        at mesosphere.marathon.integration.GroupDeployIntegrationTest.waitForEventMatching(GroupDeployIntegrationTest.scala:14)
        at mesosphere.marathon.integration.setup.MarathonTest$class.waitForEventWith(MarathonTest.scala:467)
        at mesosphere.marathon.integration.GroupDeployIntegrationTest.waitForEventWith(GroupDeployIntegrationTest.scala:14)
        at mesosphere.marathon.integration.setup.MarathonTest$class.waitForDeploymentId(MarathonTest.scala:451)
        at mesosphere.marathon.integration.GroupDeployIntegrationTest.waitForDeploymentId(GroupDeployIntegrationTest.scala:14)
        at mesosphere.marathon.integration.setup.MarathonTest$class.waitForDeployment(MarathonTest.scala:524)
        at mesosphere.marathon.integration.GroupDeployIntegrationTest.waitForDeployment(GroupDeployIntegrationTest.scala:14)
        at mesosphere.marathon.integration.GroupDeployIntegrationTest$$anonfun$2$$anonfun$apply$mcV$sp$12.apply(GroupDeployIntegrationTest.scala:221)
        at mesosphere.marathon.integration.GroupDeployIntegrationTest$$anonfun$2$$anonfun$apply$mcV$sp$12.apply(GroupDeployIntegrationTest.scala:199)
        at org.scalatest.OutcomeOf$class.outcomeOf(OutcomeOf.scala:85)
        at org.scalatest.OutcomeOf$.outcomeOf(OutcomeOf.scala:104)
        at org.scalatest.Transformer.apply(Transformer.scala:22)
        at org.scalatest.Transformer.apply(Transformer.scala:20)
        at org.scalatest.WordSpecLike$$anon$1.apply(WordSpecLike.scala:1078)
        at org.scalatest.TestSuite$class.withFixture(TestSuite.scala:196)
        at mesosphere.IntegrationTest.mesosphere$RetryOnFailed$$super$withFixture(UnitTest.scala:94)
        at mesosphere.RetryOnFailed$$anonfun$withFixture$1.apply(UnitTest.scala:51)
        at mesosphere.RetryOnFailed$$anonfun$withFixture$1.apply(UnitTest.scala:51)
        at org.scalatest.Retries$class.withRetryOnFailure(Retries.scala:566)
        at mesosphere.IntegrationTest.withRetryOnFailure(UnitTest.scala:94)
        at org.scalatest.Retries$class.withRetryOnFailure(Retries.scala:462)
        at mesosphere.IntegrationTest.withRetryOnFailure(UnitTest.scala:94)
        at mesosphere.RetryOnFailed$class.withFixture(UnitTest.scala:51)
        at mesosphere.IntegrationTest.withFixture(UnitTest.scala:94)
        at org.scalatest.WordSpecLike$class.invokeWithFixture$1(WordSpecLike.scala:1075)
        at org.scalatest.WordSpecLike$$anonfun$runTest$1.apply(WordSpecLike.scala:1088)
        at org.scalatest.WordSpecLike$$anonfun$runTest$1.apply(WordSpecLike.scala:1088)
        at org.scalatest.SuperEngine.runTestImpl(Engine.scala:289)
        at org.scalatest.WordSpecLike$class.runTest(WordSpecLike.scala:1088)
        at mesosphere.IntegrationTest.org$scalatest$BeforeAndAfter$$super$runTest(UnitTest.scala:94)
        at org.scalatest.BeforeAndAfter$class.runTest(BeforeAndAfter.scala:203)
        at mesosphere.IntegrationTest.org$scalatest$BeforeAndAfterEach$$super$runTest(UnitTest.scala:94)
        at org.scalatest.BeforeAndAfterEach$class.runTest(BeforeAndAfterEach.scala:221)
        at mesosphere.IntegrationTest.runTest(UnitTest.scala:94)
        at org.scalatest.WordSpecLike$$anonfun$runTests$1.apply(WordSpecLike.scala:1147)
        at org.scalatest.WordSpecLike$$anonfun$runTests$1.apply(WordSpecLike.scala:1147)
        at org.scalatest.SuperEngine$$anonfun$traverseSubNodes$1$1.apply(Engine.scala:396)
        at org.scalatest.SuperEngine$$anonfun$traverseSubNodes$1$1.apply(Engine.scala:384)
        at scala.collection.immutable.List.foreach(List.scala:381)
        at org.scalatest.SuperEngine.traverseSubNodes$1(Engine.scala:384)
        at org.scalatest.SuperEngine.org$scalatest$SuperEngine$$runTestsInBranch(Engine.scala:373)
        at org.scalatest.SuperEngine$$anonfun$traverseSubNodes$1$1.apply(Engine.scala:410)
        at org.scalatest.SuperEngine$$anonfun$traverseSubNodes$1$1.apply(Engine.scala:384)
        at scala.collection.immutable.List.foreach(List.scala:381)
        at org.scalatest.SuperEngine.traverseSubNodes$1(Engine.scala:384)
        at org.scalatest.SuperEngine.org$scalatest$SuperEngine$$runTestsInBranch(Engine.scala:379)
        at org.scalatest.SuperEngine.runTestsImpl(Engine.scala:461)
        at org.scalatest.WordSpecLike$class.runTests(WordSpecLike.scala:1147)
        at org.scalatest.WordSpec.runTests(WordSpec.scala:1881)
        at org.scalatest.Suite$class.run(Suite.scala:1147)
        at org.scalatest.WordSpec.org$scalatest$WordSpecLike$$super$run(WordSpec.scala:1881)
        at org.scalatest.WordSpecLike$$anonfun$run$1.apply(WordSpecLike.scala:1192)
        at org.scalatest.WordSpecLike$$anonfun$run$1.apply(WordSpecLike.scala:1192)
        at org.scalatest.SuperEngine.runImpl(Engine.scala:521)
        at org.scalatest.WordSpecLike$class.run(WordSpecLike.scala:1192)
        at mesosphere.IntegrationTest.org$scalatest$BeforeAndAfter$$super$run(UnitTest.scala:94)
        at org.scalatest.BeforeAndAfter$class.run(BeforeAndAfter.scala:258)
        at mesosphere.IntegrationTest.org$scalatest$BeforeAndAfterAll$$super$run(UnitTest.scala:94)
        at org.scalatest.BeforeAndAfterAll$class.liftedTree1$1(BeforeAndAfterAll.scala:213)
        at org.scalatest.BeforeAndAfterAll$class.run(BeforeAndAfterAll.scala:210)
        at mesosphere.IntegrationTest.run(UnitTest.scala:94)
        at org.scalatest.tools.Framework.org$scalatest$tools$Framework$$runSuite(Framework.scala:314)
        at org.scalatest.tools.Framework$ScalaTestTask.execute(Framework.scala:480)
        at sbt.ForkMain$Run$2.call(ForkMain.java:296)
        at sbt.ForkMain$Run$2.call(ForkMain.java:286)
        at java.util.concurrent.FutureTask.run(FutureTask.java:266)
        at java.util.concurrent.ThreadPoolExecutor.runWorker(ThreadPoolExecutor.java:1142)
        at java.util.concurrent.ThreadPoolExecutor$Worker.run(ThreadPoolExecutor.java:617)
        at java.lang.Thread.run(Thread.java:745)
      [info] ScalaTest
      [info] Run completed in 9 minutes, 5 seconds.
      [info] Total number of tests run: 20
      [info] Suites: completed 244, aborted 0
      [info] Tests: succeeded 19, failed 1, canceled 0, ignored 0, pending 0
      [info] _ 1 TEST FAILED _
      [error] Failed: Total 20, Failed 1, Errors 0, Passed 19
      [error] Failed tests:
      [error] 	mesosphere.marathon.integration.GroupDeployIntegrationTest
      [error] (marathon/serial-integration:test) sbt.TestsFailedException: Tests unsuccessful
      [error] Total time: 558 s, completed Mar 2, 2017 9:23:26 AM
      

        Attachments

          Issue Links

            Activity

              People

              • Assignee:
                kjeschkies Karsten Jeschkies
                Reporter:
                marco.monaco Marco Monaco
                Team:
                Orchestration Team
                Watchers:
                James DeFelice, Karsten Jeschkies, Tim Harper
              • Watchers:
                3 Start watching this issue

                Dates

                • Created:
                  Updated:
                  Resolved: